{"text_format":"1","workbook":"xlsx","n_sheets":13,"sheets":["Instructions","Project Info","Savings Summary","EPE PAF","Refrigeration","Food Service","HVAC","Motors","Misc","Lookup tables","County to Zone","Utility Admin","Version Log"],"not_rendered":{"charts":0,"images":9,"macros":1,"external_links":0,"defined_names":153,"comments":0,"pivot_tables":0},"unopened":[],"bounds":{"document_bytes":16777216,"sheet_cells":100000,"rows_first":2000,"rows_last":500,"rows_between":2000,"halvings":0,"cell_chars":16384,"cell_head_chars":4096},"cells_cut":0,"cells_raw":0,"read":"whole","date_system":"1900"}

{"sheet":"Instructions","index":0,"n_rows":39,"n_cols":2,"rows_kept":39,"cut":false,"hidden":true,"merged":[[26,1,27,12],[34,1,35,13],[38,0,40,13],[1,0,2,12]]}
["Instructions"]
["This sheet provides basic instructions for using this calculator. Please contact the utility rebate program staff for further help or questions."]
[]
[]
["Getting Started"]
[]
{"$rows_left_out":34}
{"sheet":"Project Info","index":1,"n_rows":20,"n_cols":13,"rows_kept":20,"cut":false,"hidden":false,"merged":[[1,1,1,6],[0,12,0,15],[13,3,13,10],[14,3,14,8],[16,3,16,4],[17,3,17,4],[19,3,19,10],[12,3,12,5],[12,9,12,10],[3,3,3,10],[4,3,4,10],[5,3,5,10],[6,3,6,10],[8,3,8,4],[8,8,8,9],[9,3,9,4],[9,8,9,9],[10,3,10,10],[11,3,11,4],[11,8,11,10]]}
[null,"South \"Other Measures\" Calculator",null,null,null,null,null,null,null,null,"v21.0"]
[null,"A calculation tool for determining deemed savings for projects other than standard prescriptive lighting & HVAC replacements."]
[null,null,null,null,null,{"$f":"IF(OR(D9=\"\",D10=\"\",I9=\"\",I10=\"\"),\"Please fill in highlighted cells to continue.\",\"\")","v":"Please fill in highlighted cells to continue."},null,null,null,null,null,null,"Click buttons to open or close measure groups"]
[null,null,"Assessed by:"]
[null,null,"Project ID:"]
[null,null,"Project Name:"]
{"$rows_left_out":15}
{"sheet":"Savings Summary","index":2,"n_rows":51,"n_cols":17,"rows_kept":51,"cut":false,"hidden":false,"merged":[[50,7,52,9],[6,1,6,2],[34,1,36,1],[7,1,17,1],[18,1,27,1],[37,1,45,1],[28,1,33,1]]}
[null,"Savings Summary",null,null,null,null,null,null,null,null,"HIDE","HIDE","HIDE","HIDE","HIDE","HIDE","HIDE"]
[null,null,"Project Name:",{"$f":"IF('Project Info'!D6:K6=\"\",\"\",'Project Info'!D6:K6)","v":""}]
[]
[null,null,null,null,"Total Summer Peak kW Savings","Total Winter Peak kW Savings","Total Non-Coincident kW Savings","Total kWh Savings","Total Incentive*","Total Project Cost","Non-Capped Incentive"]
[null,null,null,null,{"$f":"SUM(E8:E46)","v":0},{"$f":"SUM(F8:F46)","v":0},0,0,{"$f":"IF(I48=\"Yes\",'Utility Admin'!I2,K5)","v":0},{"$f":"IF('Project Info'!D18=\"\",\"Not Entered\",'Project Info'!D18)","v":"Not Entered"},{"$f":"SUM(K8:K46)","v":0}]
[]
{"$rows_left_out":46}
{"sheet":"EPE PAF","index":3,"n_rows":26,"n_cols":20,"rows_kept":26,"cut":false,"hidden":true,"merged":[[25,1,25,16],[22,8,23,9],[19,14,19,16],[19,4,19,12],[20,11,20,16],[18,1,18,16],[24,14,24,16],[15,2,15,5],[15,6,15,10],[15,11,15,15],[24,4,24,11],[20,4,20,7],[11,3,11,16],[12,3,12,6],[12,9,12,11],[12,14,12,16],[14,2,14,5],[14,6,14,10],[14,11,14,15],[10,3,10,6],[10,9,10,16],[1,3,1,14],[2,3,2,14],[3,3,3,14],[4,5,4,12],[7,3,7,16],[8,3,8,6],[8,9,8,16],[9,3,9,5],[9,9,9,16]]}
[]
[null,null,null,"EL PASO ELECTRIC",null,null,null,null,null,null,null,null,null,null,null,"",null,null,null,""]
[null,null,null,"SMALL COMMERCIAL SOLUTIONS PROGRAM"]
[null,null,null,"2021 PAYMENT REQUEST FOR MEASURES:"]
[null,null,null,null,null,{"$f":"'Savings Summary'!Q47","v":{"$error":"#VALUE!"}}]
[]
{"$rows_left_out":21}
{"sheet":"Refrigeration","index":4,"n_rows":81,"n_cols":21,"rows_kept":81,"cut":false,"hidden":true,"merged":[[11,6,14,6],[26,4,26,8],[28,7,29,8],[42,7,47,8]]}
[null,"Refrigeration Measures",null,null,null,null,null,null,null,null,"HIDE","HIDE","HIDE","HIDE","HIDE","HIDE","HIDE","HIDE","HIDE","HIDE","HIDE"]
[null,"Click on headings to expand or collapse sections. Blue Peak kW values indicate winter peak."]
[null,"Door Gaskets"]
["HIDE","Peak kW","NC kW","kWh","Quantity of Doors","Height (inches)","Width (inches)","Number of Sides","Refrigeration Temperature"]
["HIDE",{"$f":"E5*(2*F5+IF(H5=3,1,IF(H5=4,2,0))*G5)/12*IFERROR(INDEX('Lookup tables'!$G$3:$H$4,MATCH(Refrigeration!I5,'Lookup tables'!$D$3:$D$4,0),MATCH('Utility Admin'!$J$2,'Lookup tables'!$E$1:$F$1,0)),0)","v":0},{"$f":"E5*(2*F5+IF(H5=3,1,IF(H5=4,2,0))*G5)/12*IFERROR(INDEX('Lookup tables'!$I$3:$J$4,MATCH(Refrigeration!I5,'Lookup tables'!$D$3:$D$4,0),MATCH('Utility Admin'!$J$2,'Lookup tables'!$E$1:$F$1,0)),0)","v":0},{"$f":"IFERROR(E5*(2*F5+IF(H5=3,1,IF(H5=4,2,0))*G5)/12*INDEX('Lookup tables'!$E$3:$F$4,MATCH(Refrigeration!I5,'Lookup tables'!$D$3:$D$4,0),MATCH('Utility Admin'!$J$2,'Lookup tables'!$E$1:$F$1,0)),0)","v":0}]
["HIDE",{"$f":"E6*(2*F6+IF(H6=3,1,IF(H6=4,2,0))*G6)/12*IFERROR(INDEX('Lookup tables'!$G$3:$H$4,MATCH(Refrigeration!I6,'Lookup tables'!$D$3:$D$4,0),MATCH('Utility Admin'!$J$2,'Lookup tables'!$E$1:$F$1,0)),0)","v":0},{"$f":"E6*(2*F6+IF(H6=3,1,IF(H6=4,2,0))*G6)/12*IFERROR(INDEX('Lookup tables'!$I$3:$J$4,MATCH(Refrigeration!I6,'Lookup tables'!$D$3:$D$4,0),MATCH('Utility Admin'!$J$2,'Lookup tables'!$E$1:$F$1,0)),0)","v":0},{"$f":"IFERROR(E6*(2*F6+IF(H6=3,1,IF(H6=4,2,0))*G6)/12*INDEX('Lookup tables'!$E$3:$F$4,MATCH(Refrigeration!I6,'Lookup tables'!$D$3:$D$4,0),MATCH('Utility Admin'!$J$2,'Lookup tables'!$E$1:$F$1,0)),0)","v":0}]
{"$rows_left_out":76}
{"sheet":"Food Service","index":5,"n_rows":75,"n_cols":20,"rows_kept":75,"cut":false,"hidden":true,"merged":[[52,12,53,12],[52,13,53,13],[52,14,53,14],[15,6,15,7],[16,6,16,7],[17,6,17,7],[18,6,18,7],[68,1,69,1],[66,1,67,1],[72,1,73,1],[70,1,71,1],[74,2,74,9],[65,2,65,9],[66,2,67,9],[68,2,69,9],[70,2,71,9],[72,2,73,9]]}
[null,"Commercial Food Service Measures",null,null,null,null,null,null,null,null,null,null,"HIDE","HIDE","HIDE","HIDE","HIDE","HIDE","HIDE","HIDE"]
[null,"Click on headings to expand or collapse sections. Blue Peak kW values indicate winter peak."]
[null,"ENERGY STAR Electric Convection Oven"]
["HIDE","Peak kW","NC kW","kWh","Number of Ovens","Oven Size"]
["HIDE",{"$f":"IFERROR(VLOOKUP(F5,'Lookup tables'!$D$130:$K$131,3,FALSE)*E5,0)","v":0},{"$f":"IFERROR(VLOOKUP(F5,'Lookup tables'!$D$130:$K$131,4,FALSE)*E5,0)","v":0},{"$f":"IFERROR(VLOOKUP(F5,'Lookup tables'!$D$130:$K$131,2,FALSE)*E5,0)","v":0}]
["HIDE",{"$f":"IFERROR(VLOOKUP(F6,'Lookup tables'!$D$130:$K$131,3,FALSE)*E6,0)","v":0},{"$f":"IFERROR(VLOOKUP(F6,'Lookup tables'!$D$130:$K$131,4,FALSE)*E6,0)","v":0},{"$f":"IFERROR(VLOOKUP(F6,'Lookup tables'!$D$130:$K$131,2,FALSE)*E6,0)","v":0}]
{"$rows_left_out":70}
{"sheet":"HVAC","index":6,"n_rows":47,"n_cols":21,"rows_kept":47,"cut":false,"hidden":true,"merged":[[29,13,30,13],[29,15,30,15],[34,7,34,9],[14,5,14,6],[22,7,22,9],[29,12,30,12]]}
[null,"HVAC Measures",null,null,null,null,null,null,null,null,null,"HIDE","HIDE","HIDE","HIDE","HIDE","HIDE","HIDE","HIDE","HIDE","HIDE"]
[null,"Click on headings to expand or collapse sections. Blue Peak kW values indicate winter peak."]
[null,"HVAC Variable Frequency Drives (VFD's)"]
["HIDE","Peak kW","NCP kW","kWh","Quantity","Application","Building Type","Motor Size (HP)","Existing Control Type\n(AHU Supply Fans Only)",null,null,"kWh/HP","kW/HP Summer","kW/HP Winter","NCP kW/HP"]
["HIDE",{"$f":"E5*H5*MAX(M5,N5)","v":0},{"$f":"E5*H5*O5","v":0},{"$f":"E5*H5*L5","v":0},null,null,null,null,null,null,null,{"$f":"IFERROR(INDEX(VFDSavingsTable,MATCH(1,(State&SelectedZone='Lookup tables'!$D$274:$D$309)*(HVAC!F5='Lookup tables'!$E$274:$E$309)*(HVAC!I5='Lookup tables'!$F$274:$F$309),0),MATCH(1,(HVAC!G5='Lookup tables'!$G$272:$X$272)*(\"kWh\"='Lookup tables'!$G$273:$X$273),0)),0)","v":0},{"$f":"IF(F5=\"Hot Water Pump\",0,IFERROR(INDEX(VFDSavingsTable,MATCH(1,(State&SelectedZone='Lookup tables'!$D$274:$D$309)*(HVAC!F5='Lookup tables'!$E$274:$E$309)*(HVAC!I5='Lookup tables'!$F$274:$F$309),0),MATCH(1,(HVAC!G5='Lookup tables'!$G$272:$X$272)*(\"kW\"='Lookup tables'!$G$273:$X$273),0)),0))","v":0},{"$f":"IF(F5=\"Hot Water Pump\",IFERROR(INDEX(VFDSavingsTable,MATCH(1,(State&SelectedZone='Lookup tables'!$D$274:$D$309)*(HVAC!F5='Lookup tables'!$E$274:$E$309)*(HVAC!I5='Lookup tables'!$F$274:$F$309),0),MATCH(1,(HVAC!G5='Lookup tables'!$G$272:$X$272)*(\"kW\"='Lookup tables'!$G$273:$X$273),0)),0),0)","v":0},{"$f":"IFERROR(INDEX(VFDSavingsTable,MATCH(1,(State&SelectedZone='Lookup tables'!$D$274:$D$309)*(HVAC!F5='Lookup tables'!$E$274:$E$309)*(HVAC!I5='Lookup tables'!$F$274:$F$309),0),MATCH(1,(HVAC!G5='Lookup tables'!$G$272:$AG$272)*(\"NCP kW\"='Lookup tables'!$G$273:$AG$273),0)),0)","v":0}]
["HIDE",0,{"$f":"E6*H6*O6","v":0},{"$f":"E6*H6*L6","v":0},null,null,null,null,null,null,null,{"$f":"IFERROR(INDEX(VFDSavingsTable,MATCH(1,(State&SelectedZone='Lookup tables'!$D$274:$D$309)*(HVAC!F6='Lookup tables'!$E$274:$E$309)*(HVAC!I6='Lookup tables'!$F$274:$F$309),0),MATCH(1,(HVAC!G6='Lookup tables'!$G$272:$X$272)*(\"kWh\"='Lookup tables'!$G$273:$X$273),0)),0)","v":0},{"$f":"IF(F6=\"Hot Water Pump\",0,IFERROR(INDEX(VFDSavingsTable,MATCH(1,(State&SelectedZone='Lookup tables'!$D$274:$D$309)*(HVAC!F6='Lookup tables'!$E$274:$E$309)*(HVAC!I6='Lookup tables'!$F$274:$F$309),0),MATCH(1,(HVAC!G6='Lookup tables'!$G$272:$X$272)*(\"kW\"='Lookup tables'!$G$273:$X$273),0)),0))","v":0},{"$f":"IF(F6=\"Hot Water Pump\",IFERROR(INDEX(VFDSavingsTable,MATCH(1,(State&SelectedZone='Lookup tables'!$D$274:$D$309)*(HVAC!F6='Lookup tables'!$E$274:$E$309)*(HVAC!I6='Lookup tables'!$F$274:$F$309),0),MATCH(1,(HVAC!G6='Lookup tables'!$G$272:$X$272)*(\"kW\"='Lookup tables'!$G$273:$X$273),0)),0),0)","v":0},{"$f":"IFERROR(INDEX(VFDSavingsTable,MATCH(1,(State&SelectedZone='Lookup tables'!$D$274:$D$309)*(HVAC!F6='Lookup tables'!$E$274:$E$309)*(HVAC!I6='Lookup tables'!$F$274:$F$309),0),MATCH(1,(HVAC!G6='Lookup tables'!$G$272:$AG$272)*(\"NCP kW\"='Lookup tables'!$G$273:$AG$273),0)),0)","v":0}]
{"$rows_left_out":42}
{"sheet":"Motors","index":7,"n_rows":22,"n_cols":34,"rows_kept":22,"cut":false,"hidden":true,"merged":[[16,20,17,20],[16,12,17,12],[16,13,17,13],[16,14,17,14],[16,21,17,21],[16,15,17,15],[16,16,17,16],[16,17,17,17],[16,18,17,18],[16,19,17,19]]}
[null,"Motor Measures",null,null,null,null,null,null,null,null,null,null,"HIDE","HIDE","HIDE","HIDE","HIDE","HIDE","HIDE","HIDE","HIDE","HIDE","HIDE","HIDE","HIDE","HIDE","HIDE","HIDE","HIDE","HIDE","HIDE","HIDE","HIDE","HIDE"]
[null,"Click on headings to expand or collapse sections. Blue Peak kW values indicate winter peak."]
[null,"ENERGY STAR Commercial Pool Pumps"]
["HIDE","Peak kW","NCP kW","kWh","Pump Quantity","Rated Pump hp (New)","Pool Operation"]
["HIDE",{"$f":"IFERROR(INDEX('Lookup tables'!H$416:J$420,MATCH(Motors!F5,PoolPumpMotorSize,0),MATCH(Motors!G5,PoolPumpOperation,0))*Motors!E5,0)","v":0},{"$f":"B5","v":0},{"$f":"IFERROR(INDEX('Lookup tables'!E$416:G$420,MATCH(Motors!F5,PoolPumpMotorSize,0),MATCH(Motors!G5,PoolPumpOperation,0))*Motors!E5,0)","v":0}]
["HIDE",{"$f":"IFERROR(INDEX('Lookup tables'!H$416:J$420,MATCH(Motors!F6,PoolPumpMotorSize,0),MATCH(Motors!G6,PoolPumpOperation,0))*Motors!E6,0)","v":0},{"$f":"B6","v":0},{"$f":"IFERROR(INDEX('Lookup tables'!E$416:G$420,MATCH(Motors!F6,PoolPumpMotorSize,0),MATCH(Motors!G6,PoolPumpOperation,0))*Motors!E6,0)","v":0}]
{"$rows_left_out":17}
{"sheet":"Misc","index":8,"n_rows":61,"n_cols":23,"rows_kept":61,"cut":false,"hidden":true,"merged":[[16,14,17,14],[9,5,9,6],[9,7,9,8],[15,5,15,6],[15,8,15,9],[16,13,17,13]]}
[null,"Miscellaneous Measures",null,null,null,null,null,null,null,null,null,"HIDE","HIDE","HIDE","HIDE","HIDE","HIDE","HIDE","HIDE","HIDE","HIDE","HIDE","HIDE"]
[null,"Click on headings to expand or collapse sections. Blue Peak kW values indicate winter peak."]
[null,"Window Film Treatment"]
["HIDE","Peak kW","NCP kW","kWh","Area of Window Film (square feet)","Window Orientation","Existing Window Type","Post Shading Coefficient\n(from manufacturer specs)","HVAC Installation Year","HVAC Type",null,"SHG","SHGF","SHGF NCP","SCpre","SCpost","Conversion Factor (Btu/kW)","COP","kWh"]
["HIDE",{"$f":"IFERROR(IF(H5=\"\",0,E5*M5*(O5-P5)/(Q5*R5)),0)","v":0},{"$f":"IFERROR(IF(H5=\"\",0,E5*N5*(O5-P5)/(Q5*R5)),0)","v":0},{"$f":"IFERROR(IF(H5=\"\",0,S5),0)","v":0},null,null,null,null,null,null,null,{"$f":"VLOOKUP(F5,'Lookup tables'!$D$503:$E$511,2,FALSE)","v":{"$error":"#N/A"}},{"$f":"VLOOKUP(F5,'Lookup tables'!$D$503:$K$511,MATCH(State&SelectedZone,'Lookup tables'!$D$502:$K$502,0),FALSE)","v":{"$error":"#N/A"}},{"$f":"INDEX('Lookup tables'!L$503:L$511,MATCH(Misc!F5,Orientation,0))","v":{"$error":"#N/A"}},{"$f":"INDEX('Lookup tables'!P$503:P$506,MATCH(Misc!G5,WindowFilmExistingWindowType,0))","v":{"$error":"#N/A"}},{"$f":"H5","v":0},3413,{"$f":"INDEX('Lookup tables'!S$504:V$506,MATCH(Misc!I5,WindowFilmConstruction,0),MATCH(Misc!J5,WindowFilmHVACType,0))","v":{"$error":"#N/A"}},{"$f":"E5*L5*(O5-P5)/(Q5*R5)","v":{"$error":"#N/A"}}]
["HIDE",{"$f":"IFERROR(IF(H6=\"\",0,E6*M6*(O6-P6)/(Q6*R6)),0)","v":0},{"$f":"IFERROR(IF(H6=\"\",0,E6*N6*(O6-P6)/(Q6*R6)),0)","v":0},{"$f":"IFERROR(IF(H6=\"\",0,S6),0)","v":0},null,null,null,null,null,null,null,{"$f":"VLOOKUP(F6,'Lookup tables'!$D$503:$E$511,2,FALSE)","v":{"$error":"#N/A"}},{"$f":"VLOOKUP(F6,'Lookup tables'!$D$503:$K$511,MATCH(State&SelectedZone,'Lookup tables'!$D$502:$K$502,0),FALSE)","v":{"$error":"#N/A"}},{"$f":"INDEX('Lookup tables'!L$503:L$511,MATCH(Misc!F6,Orientation,0))","v":{"$error":"#N/A"}},{"$f":"INDEX('Lookup tables'!P$503:P$506,MATCH(Misc!G6,WindowFilmExistingWindowType,0))","v":{"$error":"#N/A"}},{"$f":"H6","v":0},3413,{"$f":"INDEX('Lookup tables'!S$504:V$506,MATCH(Misc!I6,WindowFilmConstruction,0),MATCH(Misc!J6,WindowFilmHVACType,0))","v":{"$error":"#N/A"}},{"$f":"E6*L6*(O6-P6)/(Q6*R6)","v":{"$error":"#N/A"}}]
{"$rows_left_out":56}
{"sheet":"Lookup tables","index":9,"n_rows":738,"n_cols":33,"rows_kept":738,"cut":false,"hidden":true,"merged":[[718,1,719,1],[729,1,730,1],[267,1,268,1],[128,1,129,1],[1,1,2,1],[698,1,699,1],[711,1,712,1],[679,1,680,1],[407,1,408,1],[162,2,163,2],[9,1,10,1],[21,1,22,1],[32,1,33,1],[153,1,156,1],[133,1,134,1],[42,1,43,1],[61,1,62,1],[160,2,161,2],[164,2,165,2],[192,1,193,1],[198,1,199,1],[512,1,513,1],[168,1,169,1],[489,1,490,1],[412,1,413,1],[338,1,339,1],[660,20,660,23],[500,17,500,18],[421,1,422,1],[670,1,671,1],[499,1,500,1],[659,1,660,1],[660,8,660,11],[660,12,660,15],[660,16,660,19],[440,4,440,9],[413,7,413,9],[203,1,204,1],[203,6,203,11],[660,28,660,31],[397,1,398,1],[440,10,440,15],[660,24,660,27],[312,16,312,27],[367,1,368,1],[312,1,313,1],[211,1,212,1],[220,1,221,1],[247,1,248,1],[273,1,274,1],[413,4,413,6],[500,14,500,15]]}
[null,null,null,null,"TX","CPS","TX","CPS","TX","CPS"]
[null,"Door Gaskets",null,null,"kWh","kWh","kW","kW","NCP kW","NCP kW"]
[null,null,null,"Low Temperature",26.5,115,3.0000000000000001E-3,6.7600000000000004E-3,0,6.8900000000000003E-3]
[null,null,null,"Medium Temperature",3.5,15,4.0000000000000002E-4,1.2899999999999999E-3,0,1.32E-3]
[]
[]
{"$rows_left_out":733}
{"sheet":"County to Zone","index":10,"n_rows":257,"n_cols":5,"rows_kept":257,"cut":false,"hidden":true,"merged":[]}
["TX",null,null,"Selected Zone:",{"$f":"IF(Utility=\"CPS Energy\",\"CPS\",INDEX(INDIRECT(State&\"ZONE\"),MATCH(County,INDIRECT(State&\"ZONE[County]\"),0),2))","v":{"$error":"#N/A"}}]
["County","Zone"]
["Anderson",2]
["Andrews",2]
["Angelina",2]
["Aransas",4]
{"$rows_left_out":252}
{"sheet":"Utility Admin","index":11,"n_rows":53,"n_cols":67,"rows_kept":53,"cut":false,"hidden":true,"merged":[[2,12,3,12],[2,61,2,66],[2,44,2,49],[2,52,2,56],[2,58,2,60],[2,27,2,32],[2,41,2,43],[2,35,2,40],[2,18,2,23],[2,6,3,6],[2,24,2,26],[2,1,3,1],[2,2,3,2],[2,3,3,3],[2,4,3,4],[2,5,3,5],[2,13,3,13],[2,14,3,14],[2,15,3,15],[2,7,3,7],[2,8,3,8],[2,9,3,9],[2,10,3,10],[2,11,3,11]]}
[null,null,null,null,null,null,null,null,null,null,null,null,null,null,null,null,"$/NCPkW","$/NCPkW","$/NCPkW","$/NCPkW","$/NCPkW","$/NCPkW","$/NCPkW","$/NCPkW","$/NCPkW","$/NCPkW","$/NCPkW","$/NCPkW","$/NCPkW","$/NCPkW","$/NCPkW","$/NCPkW","$/NCPkW","$/kW","$/kW","$/kW","$/kW","$/kW","$/kW","$/kW","$/kW","$/kW","$/kW","$/kW","$/kW","$/kW","$/kW","$/kW","$/kW","$/kW","$/kWh","$/kWh","$/kWh","$/kWh","$/kWh","$/kWh","$/kWh","$/kWh","$/kWh","$/kWh","$/kWh","$/kWh","$/kWh","$/kWh","$/kWh","$/kWh","$/kWh"]
[null,{"$f":"'Project Info'!D9","v":"TX"},{"$f":"'Project Info'!I9","v":0},{"$f":"B2&C2","v":"TX0"},{"$f":"'Project Info'!I10","v":0},{"$f":"D2&E2","v":"TX00"},{"$f":"IF('Project Info'!$I$9=\"\",0,INDEX(G5:G21,MATCH($F2,$F$5:$F$21,0),1))","v":0},{"$f":"IF('Project Info'!$I$9=\"\",0,INDEX(H5:H21,MATCH($F2,$F$5:$F$21,0),1))","v":0},{"$f":"IF('Project Info'!$I$9=\"\",0,IF(INDEX(I5:I21,MATCH($F2,$F$5:$F$21,0),1)=0,999999,INDEX(I5:I21,MATCH($F2,$F$5:$F$21,0),1)))","v":0},{"$f":"IF('Project Info'!$I$9=\"\",0,INDEX(J5:J21,MATCH($F2,$F$5:$F$21,0),1))","v":0},{"$f":"IF('Project Info'!$I$9=\"\",\"No\",INDEX(K5:K21,MATCH($F2,$F$5:$F$21,0),1))","v":"No"},{"$f":"IF('Project Info'!$I$9=\"\",0,INDEX(L5:L21,MATCH($F2,$F$5:$F$21,0),1))","v":0},{"$f":"IF('Project Info'!$I$9=\"\",0,INDEX(M5:M21,MATCH($F2,$F$5:$F$21,0),1))","v":0},{"$f":"IF('Project Info'!$I$9=\"\",0,INDEX(N5:N21,MATCH($F2,$F$5:$F$21,0),1))","v":0},{"$f":"IF('Project Info'!$I$9=\"\",0,INDEX(O5:O21,MATCH($F2,$F$5:$F$21,0),1))","v":0},{"$f":"IF('Project Info'!$I$9=\"\",0,INDEX(P5:P21,MATCH($C2,$C$5:$C$21,0),1))","v":0},{"$f":"IF($C$2=\"\",0,INDEX(Q5:Q21,MATCH($F2,$F$5:$F$21,0),1))","v":{"$error":"#N/A"}},{"$error":"#N/A"},{"$error":"#N/A"},{"$error":"#N/A"},{"$error":"#N/A"},{"$error":"#N/A"},{"$error":"#N/A"},{"$f":"IF($C$2=\"\",0,INDEX(X5:X21,MATCH($F2,$F$5:$F$21,0),1))","v":{"$error":"#N/A"}},{"$error":"#N/A"},{"$error":"#N/A"},{"$error":"#N/A"},{"$error":"#N/A"},{"$error":"#N/A"},{"$error":"#N/A"},{"$error":"#N/A"},{"$f":"IF($C$2=\"\",0,INDEX(AF5:AF21,MATCH($F2,$F$5:$F$21,0),1))","v":{"$error":"#N/A"}},{"$error":"#N/A"},{"$error":"#N/A"},{"$error":"#N/A"},{"$error":"#N/A"},{"$error":"#N/A"},{"$error":"#N/A"},{"$error":"#N/A"},{"$error":"#N/A"},{"$f":"IF($C$2=\"\",0,INDEX(AO5:AO21,MATCH($F2,$F$5:$F$21,0),1))","v":{"$error":"#N/A"}},{"$error":"#N/A"},{"$error":"#N/A"},{"$error":"#N/A"},{"$error":"#N/A"},{"$error":"#N/A"},{"$error":"#N/A"},{"$error":"#N/A"},{"$f":"IF($C$2=\"\",0,INDEX(AW5:AW21,MATCH($F2,$F$5:$F$21,0),1))","v":{"$error":"#N/A"}},{"$error":"#N/A"},{"$error":"#N/A"},{"$error":"#N/A"},{"$error":"#N/A"},{"$error":"#N/A"},{"$error":"#N/A"},{"$error":"#N/A"},{"$error":"#N/A"},{"$f":"IF($C$2=\"\",0,INDEX(BF5:BF21,MATCH($F2,$F$5:$F$21,0),1))","v":{"$error":"#N/A"}},{"$error":"#N/A"},{"$error":"#N/A"},{"$error":"#N/A"},{"$error":"#N/A"},{"$error":"#N/A"},{"$error":"#N/A"},{"$error":"#N/A"},{"$f":"IF($C$2=\"\",0,INDEX(BN5:BN21,MATCH($F2,$F$5:$F$21,0),1))","v":{"$error":"#N/A"}},{"$error":"#N/A"}]
[null,"State","Utility","StateUtility","Program","StateUtilityProgram","Max base","Max %","Max incentive","TRM","Load Factor","Discount","Escalation","AC kW","AC kWh","Abbreviated for Name Mgr",null,null,"HVAC",null,null,null,null,null,"Motors",null,null,"Miscellaneous",null,null,null,null,null,null,null,"HVAC",null,null,null,null,null,"Motors",null,null,"Miscellaneous",null,null,null,null,null,null,null,"HVAC",null,null,null,null,null,"Motors",null,null,"Miscellaneous"]
[null,null,null,null,null,null,null,null,null,null,null,null,null,null,null,null,"Refrigeration","Food Service","Variable Frequency Drives (VFD's)","Condenser Air Evaporative Pre-Cooling","Lodging Occupancy Controls","Commercial Smart Thermostats","High-Volume Low-Speed (HVLS) Fans","ECM or VFD for Computer Room Air Handlers","EnergyStar Commercial Pool Pumps","Premium Efficiency Motors","Pump Off Controller","Window Film Treatment","EnergyStar Roofing","Entrance & Exit Door Air Infiltration","PC Power Management","Central DHW Controls","Electric Vehicle Supply Equipment","Refrigeration","Food Service","Variable Frequency Drives (VFD's)","Condenser Air Evaporative Pre-Cooling","Lodging Occupancy Controls","Commercial Smart Thermostats","High-Volume Low-Speed (HVLS) Fans","ECM or VFD for Computer Room Air Handlers","EnergyStar Commercial Pool Pumps","Premium Efficiency Motors","Pump Off Controller","Window Film Treatment","EnergyStar Roofing","Entrance & Exit Door Air Infiltration","PC Power Management","Central DHW Controls","Electric Vehicle Supply Equipment","Refrigeration","Food Service","Variable Frequency Drives (VFD's)","Condenser Air Evaporative Pre-Cooling","Lodging Occupancy Controls","Commercial Smart Thermostats","High-Volume Low-Speed (HVLS) Fans","ECM or VFD for Computer Room Air Handlers","EnergyStar Commercial Pool Pumps","Premium Efficiency Motors","Pump Off Controller","Window Film Treatment","EnergyStar Roofing","Entrance & Exit Door Air Infiltration","PC Power Management","Central DHW Controls","Electric Vehicle Supply Equipment"]
[null,"TX","AEP SWEPCO",{"$f":"B5&C5","v":"TXAEP SWEPCO"},"Commercial Solutions",{"$f":"D5&E5","v":"TXAEP SWEPCOCommercial Solutions"},null,null,{"$f":"IF('Project Info'!$D$18=\"\",'Utility Admin'!G5,MIN(H5*'Project Info'!$D$18,G5))","v":0},"TX","No",0.02,7.1800000000000003E-2,80,0.11360000000000001,"SWEPCOTX",null,null,null,null,null,null,null,null,null,null,null,null,null,null,null,null,null,250,250,250,250,250,250,250,250,250,250,250,250,250,250,250,250,250,0,0,0,0,0,0,0,0,0,0,0,0,0,0,0,0,0]
[null,"TX","AEP SWEPCO","TXAEP SWEPCO","SCORE","TXAEP SWEPCOSCORE",null,null,{"$f":"IF('Project Info'!$D$18=\"\",'Utility Admin'!G6,MIN(H6*'Project Info'!$D$18,G6))","v":0},"TX","No",0.02,7.1800000000000003E-2,80,0.11360000000000001,"SWEPCOTX",null,null,null,null,null,null,null,null,null,null,null,null,null,null,null,null,null,250,250,250,250,250,250,250,250,250,250,250,250,250,250,250,250,250,0,0,0,0,0,0,0,0,0,0,0,0,0,0,0,0,0]
{"$rows_left_out":48}
{"sheet":"Version Log","index":12,"n_rows":130,"n_cols":7,"rows_kept":130,"cut":false,"hidden":true,"merged":[[1,1,1,5],[3,5,3,6],[4,2,4,3],[4,5,4,6]]}
[]
[null,"Version Log"]
[]
[null,"Original Author:","A. Boone Drummond / A Keeling",null,"QA/QC Engineer(s):","A. Boone Drummond"]
[null,"Primary Developer:","Adam Groenhuyzen",null,"Senior Engineer Approval:"]
[]
{"$rows_left_out":124}